Target
Presenilin-1
Ligand
BDBM50492083
Substrate
Meas. Tech.
ChEMBL_968577 (CHEMBL2401297)
IC50
0.570000±n/a nM
Citation
 Ye, XMKonradi, AWSun, MYuan, SAubele, DLDappen, MDressen, DGarofalo, AWJagodzinski, JJLatimer, LProbst, GDSham, HLWone, DXu, YZNess, DBrigham, EKwong, GTWilltis, CTonn, GGoldbach, EQuinn, KPZhang, HHSauer, JMBova, MBasi, GS Discovery of a novel [3.2.1] benzo fused bicyclic sulfonamide-pyrazoles as potent, selective and efficacious ?-secretase inhibitors. Bioorg Med Chem Lett 23:996-1000 (2013)  
Target
Name:
Presenilin-1
Synonyms:
3.4.23.- Gamma-Secretase Subunit Presenilin-1 PS1 PSEN1 PSNL1 Presenilin-1 CTF12 Protein S182
Type:
Mol. Mass.:
52657.13
Organism:
Homo sapiens (Human)
Description:
P49768
Residue:
467
  
Inhibitor
Name:
BDBM50492083
Synonyms:
CHEMBL2396960
Type:
Small organic molecule
Emp. Form.:
C19H13ClF3N3O2S
Mol. Mass.:
439.839
SMILES:
[H][C@]12Cc3n[nH]cc3[C@]([H])(N1S(=O)(=O)c1cccc(c1)C(F)(F)F)c1cc(Cl)ccc21
: