Target
5-hydroxytryptamine receptor 1A
Ligand
BDBM50035305
Substrate
Meas. Tech.
ChEMBL_1469 (CHEMBL616592)
Ki
2±n/a nM
Citation
 Stjernlöf, PElebring, TNilsson, JAndersson, BLagerkvist, SSvensson, KEkman, ACarlsson, AWikström, H 6,7,8,9-Tetrahydro-N,N-di-n-propyl-3H-benzindol-8-amines. Derivatives as potent and orally active serotonin 5-HT1A receptor agonists. J Med Chem 37:3263-73 (1994)  
Target
Name:
5-hydroxytryptamine receptor 1A
Synonyms:
5-HT-1A 5-HT1A 5-hydroxytryptamine receptor 1A (5HT1A) 5ht1a Htr1a Serotonin 1a (5-HT1a) receptor/Adrenergic receptor alpha-1 | Serotonin receptor 1A
Type:
G Protein-Coupled Receptor (GPCR)
Mol. Mass.:
46445.29
Organism:
Rattus norvegicus (rat)
Description:
Binding assays were performed using rat hippocampal membranes.
Residue:
422
  
Inhibitor
Name:
BDBM50035305
Synonyms:
(S)-8-Dipropylamino-6,7,8,9-tetrahydro-3H-benzo[e]indole-1-carbaldehyde | CHEMBL307786
Type:
Small organic molecule
Emp. Form.:
C19H26N2O
Mol. Mass.:
298.4225
SMILES:
CCCN(CCC)[C@H]1CCc2ccc3[nH]cc(C=O)c3c2C1
: