Target
Adenosine receptor A1
Ligand
BDBM50207816
Substrate
Meas. Tech.
ChEMBL_29643 (CHEMBL639750)
Ki
1.2±n/a nM
Citation
 Kim, HOJi, XDMelman, NOlah, MEStiles, GLJacobson, KA Structure-activity relationships of 1,3-dialkylxanthine derivatives at rat A3 adenosine receptors. J Med Chem 37:3373-82 (1994)  
Target
Name:
Adenosine receptor A1
Synonyms:
AA1R_RAT ADENOSINE A1 high Adenosine A1 receptor (A1) Adenosine receptors A1 | Adora1
Type:
Protein
Mol. Mass.:
36704.13
Organism:
Rattus norvegicus (rat)
Description:
Residue:
326
  
Inhibitor
Name:
BDBM50207816
Synonyms:
CHEMBL273094 N-(2-Amino-ethyl)-2-[4-(2,6-dioxo-1,3-dipropyl-2,3,6,7-tetrahydro-1H-purin-8-yl)-phenoxy]-acetamide (xanthine amine congenere, XAC) N-(2-Amino-ethyl)-2-[4-(2,6-dioxo-1,3-dipropyl-2,3,6,9-tetrahydro-1H-purin-8-yl)-phenoxy]-acetamide XAC
Type:
Small organic molecule
Emp. Form.:
C21H28N6O4
Mol. Mass.:
428.4848
SMILES:
CCCn1c2nc([nH]c2c(=O)n(CCC)c1=O)-c1ccc(OCC(=O)NCCN)cc1
: