Target
Neuropeptide FF receptor 2
Ligand
BDBM50037558
Substrate
Meas. Tech.
ChEMBL_143663 (CHEMBL755904)
Ki
10±n/a nM
Citation
 Gicquel, SMazarguil, HDesprat, CAllard, MDevillers, JPSimonnet, GZajac, JM Structure-activity study of neuropeptide FF: contribution of N-terminal regions to affinity and activity. J Med Chem 37:3477-81 (1994)  
Target
Name:
Neuropeptide FF receptor 2
Synonyms:
G-protein coupled receptor 74 NPFF2_RAT Npff2 Npgpr
Type:
Enzyme Catalytic Domain
Mol. Mass.:
47725.66
Organism:
RAT
Description:
NPFF2 0 RAT::Q9EQD2
Residue:
417
  
Inhibitor
Name:
BDBM50037558
Synonyms:
2-{[1-(2-{2-[2-(2-Amino-3-phenyl-propionylamino)-4-methyl-pentanoylamino]-3-phenyl-propionylamino}-acetyl)-pyrrolidine-2-carbonyl]-amino}-pentanedioic acid 5-amide 1-{[1-(1-carbamoyl-2-phenyl-ethylcarbamoyl)-4-guanidino-butyl]-amide} | CHEMBL386133
Type:
Small organic molecule
Emp. Form.:
C51H71N13O9
Mol. Mass.:
1010.1911
SMILES:
CC(C)C[C@H](NC(=O)[C@@H](N)Cc1ccccc1)C(=O)N[C@@H](Cc1ccccc1)C(=O)NCC(=O)N1CCC[C@H]1C(=O)N[C@@H](CCC(N)=O)C(=O)N[C@@H](CCCNC(N)=N)C(=O)N[C@@H](Cc1ccccc1)C(N)=O
: