Target
Prolyl endopeptidase
Ligand
BDBM50037614
Substrate
Meas. Tech.
ChEMBL_157477 (CHEMBL765796)
IC50
2020±n/a nM
Citation
 Tsutsumi, SOkonogi, TShibahara, SOhuchi, SHatsushiba, EPatchett, AAChristensen, BG Synthesis and structure-activity relationships of peptidyl alpha-keto heterocycles as novel inhibitors of prolyl endopeptidase. J Med Chem 37:3492-502 (1994)  
Target
Name:
Prolyl endopeptidase
Synonyms:
3.4.21.26 PPCE_PIG Post-proline cleaving enzyme
Type:
Mol. Mass.:
80758.04
Organism:
Sus scrofa
Description:
Residue:
710
  
Inhibitor
Name:
BDBM50037614
Synonyms:
(S)-2-[(S)-2-(Thiophene-2-carbonyl)-pyrrolidine-1-carbonyl]-pyrrolidine-1-carboxylic acid benzyl ester | CHEMBL324799
Type:
Small organic molecule
Emp. Form.:
C22H24N2O4S
Mol. Mass.:
412.502
SMILES:
O=C(OCc1ccccc1)N1CCC[C@H]1C(=O)N1CCC[C@H]1C(=O)c1cccs1
: