Target
Amyloid-beta precursor protein
Ligand
BDBM50492521
Substrate
Meas. Tech.
ChEMBL_972491 (CHEMBL2409973)
Ki
>242±n/a nM
Citation
 Yoshimura, MOno, MMatsumura, KWatanabe, HKimura, HCui, MNakamoto, YTogashi, KOkamoto, YIhara, MTakahashi, RSaji, H Structure-Activity Relationships and in Vivo Evaluation of Quinoxaline Derivatives for PET Imaging of ?-Amyloid Plaques. ACS Med Chem Lett 4:596-600 (2013)  
Target
Name:
Amyloid-beta precursor protein
Synonyms:
A4 ABPP AICD-50 AICD-59 AID(57) APP Alzheimer disease amyloid protein Amyloid beta Protein Amyloid beta protein Abeta(1-42) Amyloid intracellular domain 57 Amyloid protein (Abeta42b) Beta amyloid A4 protein Beta-APP42 Beta-amyloid protein 42 C83 CVAP Gamma Secretase Gamma-CTF(57) Gamma-secretase Gamma-secretase C-terminal fragment 57 P3(40) PN-II Protease nexin-II S-APP-beta Soluble APP-beta | beta-Amyloid Precursor Protein (APP)
Type:
Single-pass type I membrane protein
Mol. Mass.:
86890.41
Organism:
Homo sapiens (Human)
Description:
P05067
Residue:
770
  
Inhibitor
Name:
BDBM50492521
Synonyms:
CHEMBL2407617
Type:
Small organic molecule
Emp. Form.:
C16H14FN3O
Mol. Mass.:
282.3028
SMILES:
Nc1ccc(cc1)-c1cnc2ccc(OCC[18F])cc2n1
: