Target
Histone deacetylase 2
Ligand
BDBM347452
Substrate
Meas. Tech.
ChEMBL_972539 (CHEMBL2410191)
Ki
0.810000±n/a nM
Citation
 Ononye, SNVanHeyst, MDOblak, EZZhou, WAmmar, MAnderson, ACWright, DL Tropolones as lead-like natural products: the development of potent and selective histone deacetylase inhibitors. ACS Med Chem Lett 4:757-61 (2013)  
Target
Name:
Histone deacetylase 2
Synonyms:
Cereblon/Histone deacetylase 2 HDAC2 Histone deacetylase 2 (HDAC2) | Human HDAC2
Type:
Chromatin regulator; hydrolase; repressor
Mol. Mass.:
55356.54
Organism:
Homo sapiens (Human)
Description:
Q92769
Residue:
488
  
Inhibitor
Name:
BDBM347452
Synonyms:
MO-OH-SM | US9790158, 3
Type:
Small organic molecule
Emp. Form.:
C14H12O3
Mol. Mass.:
228.2433
SMILES:
COc1ccc(cc1)-c1ccccc(O)c1=O
: