Target
Histone deacetylase 2
Ligand
BDBM347451
Substrate
Meas. Tech.
ChEMBL_972539 (CHEMBL2410191)
Ki
0.250000±n/a nM
Citation
 Ononye, SNVanHeyst, MDOblak, EZZhou, WAmmar, MAnderson, ACWright, DL Tropolones as lead-like natural products: the development of potent and selective histone deacetylase inhibitors. ACS Med Chem Lett 4:757-61 (2013)  
Target
Name:
Histone deacetylase 2
Synonyms:
Cereblon/Histone deacetylase 2 HDAC2 Histone deacetylase 2 (HDAC2) | Human HDAC2
Type:
Chromatin regulator; hydrolase; repressor
Mol. Mass.:
55356.54
Organism:
Homo sapiens (Human)
Description:
Q92769
Residue:
488
  
Inhibitor
Name:
BDBM347451
Synonyms:
MO-OH-NAP | US9790158, 2
Type:
Small organic molecule
Emp. Form.:
C17H12O2
Mol. Mass.:
248.276
SMILES:
Oc1ccccc(-c2ccc3ccccc3c2)c1=O
: