Target
Histone deacetylase 2
Ligand
BDBM347454
Substrate
Meas. Tech.
ChEMBL_972539 (CHEMBL2410191)
Ki
0.230000±n/a nM
Citation
 Ononye, SNVanHeyst, MDOblak, EZZhou, WAmmar, MAnderson, ACWright, DL Tropolones as lead-like natural products: the development of potent and selective histone deacetylase inhibitors. ACS Med Chem Lett 4:757-61 (2013)  
Target
Name:
Histone deacetylase 2
Synonyms:
Cereblon/Histone deacetylase 2 HDAC2 Histone deacetylase 2 (HDAC2) | Human HDAC2
Type:
Chromatin regulator; hydrolase; repressor
Mol. Mass.:
55356.54
Organism:
Homo sapiens (Human)
Description:
Q92769
Residue:
488
  
Inhibitor
Name:
BDBM347454
Synonyms:
MO-OH-TM | US9790158, 5
Type:
Small organic molecule
Emp. Form.:
C16H16O5
Mol. Mass.:
288.2952
SMILES:
COc1ccc(c(OC)c1OC)-c1ccccc(O)c1=O
: