Target
Muscarinic acetylcholine receptor M3
Ligand
BDBM50018309
Substrate
Meas. Tech.
ChEMBL_138247 (CHEMBL745497)
IC50
4000±n/a nM
Citation
 Burke, BJDunn, WJHopfinger, AJ Construction of a molecular shape analysis-three-dimensional quantitative structure-analysis relationship for an analog series of pyridobenzodiazepinone inhibitors of muscarinic 2 and 3 receptors. J Med Chem 37:3775-88 (1994)  
Target
Name:
Muscarinic acetylcholine receptor M3
Synonyms:
ACM3_RAT Chrm-3 | Chrm3
Type:
Enzyme Catalytic Domain
Mol. Mass.:
66086.66
Organism:
RAT
Description:
Cholinergic, muscarinic M3 CHRM3 RAT::P08483
Residue:
589
  
Inhibitor
Name:
BDBM50018309
Synonyms:
11-[2-(2-Morpholin-4-ylmethyl-piperidin-1-yl)-acetyl]-5,11-dihydro-benzo[e]pyrido[3,2-b][1,4]diazepin-6-one | CHEMBL432886
Type:
Small organic molecule
Emp. Form.:
C24H29N5O3
Mol. Mass.:
435.5188
SMILES:
O=C(CN1CCCCC1CN1CCOCC1)N1c2ccccc2C(=O)Nc2cccnc12
: