Target
Muscarinic acetylcholine receptor M3
Ligand
BDBM50018294
Substrate
Meas. Tech.
ChEMBL_138247 (CHEMBL745497)
IC50
2000±n/a nM
Citation
 Burke, BJDunn, WJHopfinger, AJ Construction of a molecular shape analysis-three-dimensional quantitative structure-analysis relationship for an analog series of pyridobenzodiazepinone inhibitors of muscarinic 2 and 3 receptors. J Med Chem 37:3775-88 (1994)  
Target
Name:
Muscarinic acetylcholine receptor M3
Synonyms:
ACM3_RAT Chrm-3 | Chrm3
Type:
Enzyme Catalytic Domain
Mol. Mass.:
66086.66
Organism:
RAT
Description:
Cholinergic, muscarinic M3 CHRM3 RAT::P08483
Residue:
589
  
Inhibitor
Name:
BDBM50018294
Synonyms:
11-[2-(2-Diethylaminomethyl-piperidin-1-yl)-acetyl]-9-methyl-5,11-dihydro-benzo[e]pyrido[3,2-b][1,4]diazepin-6-one | CHEMBL294919
Type:
Small organic molecule
Emp. Form.:
C25H33N5O2
Mol. Mass.:
435.5618
SMILES:
CCN(CC)CC1CCCCN1CC(=O)N1c2cc(C)ccc2C(=O)Nc2cccnc12
: