Target
Muscarinic acetylcholine receptor M3
Ligand
BDBM50018305
Substrate
Meas. Tech.
ChEMBL_138247 (CHEMBL745497)
IC50
4000±n/a nM
Citation
 Burke, BJDunn, WJHopfinger, AJ Construction of a molecular shape analysis-three-dimensional quantitative structure-analysis relationship for an analog series of pyridobenzodiazepinone inhibitors of muscarinic 2 and 3 receptors. J Med Chem 37:3775-88 (1994)  
Target
Name:
Muscarinic acetylcholine receptor M3
Synonyms:
ACM3_RAT Chrm-3 | Chrm3
Type:
Enzyme Catalytic Domain
Mol. Mass.:
66086.66
Organism:
RAT
Description:
Cholinergic, muscarinic M3 CHRM3 RAT::P08483
Residue:
589
  
Inhibitor
Name:
BDBM50018305
Synonyms:
8-Bromo-11-[2-(2-diethylaminomethyl-piperidin-1-yl)-acetyl]-5,11-dihydro-benzo[e]pyrido[3,2-b][1,4]diazepin-6-one | CHEMBL299344
Type:
Small organic molecule
Emp. Form.:
C24H30BrN5O2
Mol. Mass.:
500.431
SMILES:
CCN(CC)CC1CCCCN1CC(=O)N1c2ccc(Br)cc2C(=O)Nc2cccnc12
: