Target
Glutamate receptor ionotropic, NMDA 2C
Ligand
BDBM50038159
Substrate
Meas. Tech.
ChEMBL_140491 (CHEMBL747081)
Ki
2500±n/a nM
Citation
 Leeson, PDIversen, LL The glycine site on the NMDA receptor: structure-activity relationships and therapeutic potential. J Med Chem 37:4053-67 (1995)  
Target
Name:
Glutamate receptor ionotropic, NMDA 2C
Synonyms:
Glutamate NMDA receptor; Grin1/Grin2c Grin2c NMDE3_RAT
Type:
Protein
Mol. Mass.:
135305.94
Organism:
Rattus norvegicus (Rat)
Description:
Q00961
Residue:
1237
  
Inhibitor
Name:
BDBM50038159
Synonyms:
(R)-3-Amino-1-hydroxy-pyrrolidin-2-one | CHEMBL335231
Type:
Small organic molecule
Emp. Form.:
C4H8N2O2
Mol. Mass.:
116.1185
SMILES:
N[C@@H]1CCN(O)C1=O
: