Target
Muscarinic acetylcholine receptor M1
Ligand
BDBM50038243
Substrate
Meas. Tech.
ChEMBL_139963 (CHEMBL749018)
Ki
1100±n/a nM
Citation
 Moltzen, EKPedersen, HBøgesø, KPMeier, EFrederiksen, KSánchez, CLøve Lembøl, H Bioisosteres of arecoline: 1,2,3,6-tetrahydro-5-pyridyl-substituted and 3-piperidyl-substituted derivatives of tetrazoles and 1,2,3-triazoles. Synthesis and muscarinic activity. J Med Chem 37:4085-99 (1995)  
Target
Name:
Muscarinic acetylcholine receptor M1
Synonyms:
ACM1_RAT Chrm-1 cholinergic receptor, muscarinic 1
Type:
Enzyme Catalytic Domain
Mol. Mass.:
51390.46
Organism:
RAT
Description:
P08482
Residue:
460
  
Inhibitor
Name:
BDBM50038243
Synonyms:
3-(2-Ethyl-2H-tetrazol-5-yl)-piperidine | CHEMBL130148
Type:
Small organic molecule
Emp. Form.:
C8H15N5
Mol. Mass.:
181.2382
SMILES:
CCn1nnc(n1)C1CCCNC1
: