Target
Carbonic anhydrase 2
Ligand
BDBM50492461
Substrate
Meas. Tech.
ChEMBL_975781 (CHEMBL2415309)
Ki
0.910000±n/a nM
Citation
 Akdemir, AGüzel-Akdemir, OScozzafava, ACapasso, CSupuran, CT Inhibition of tumor-associated human carbonic anhydrase isozymes IX and XII by a new class of substituted-phenylacetamido aromatic sulfonamides. Bioorg Med Chem 21:5228-32 (2013)  
Target
Name:
Carbonic anhydrase 2
Synonyms:
CA-II CAC Carbonate dehydratase II Carbonic anhydrase 2 (CA-II) Carbonic anhydrase C Carbonic anhydrase II (CA-II) Carbonic anhydrase II (hCA II) | Carbonic anhydrase isoenzyme II (hCA II)
Type:
Enzyme
Mol. Mass.:
29250.71
Organism:
Homo sapiens (Human)
Description:
P00918
Residue:
260
  
Inhibitor
Name:
BDBM50492461
Synonyms:
CHEMBL2402775
Type:
Small organic molecule
Emp. Form.:
C14H12BrClN2O3S
Mol. Mass.:
403.679
SMILES:
NS(=O)(=O)c1ccc(NC(=O)Cc2ccccc2Br)c(Cl)c1
: