Target
Carbonic anhydrase 2
Ligand
BDBM50492477
Substrate
Meas. Tech.
ChEMBL_975781 (CHEMBL2415309)
Ki
0.880000±n/a nM
Citation
 Akdemir, AGüzel-Akdemir, OScozzafava, ACapasso, CSupuran, CT Inhibition of tumor-associated human carbonic anhydrase isozymes IX and XII by a new class of substituted-phenylacetamido aromatic sulfonamides. Bioorg Med Chem 21:5228-32 (2013)  
Target
Name:
Carbonic anhydrase 2
Synonyms:
CA-II CAC Carbonate dehydratase II Carbonic anhydrase 2 (CA-II) Carbonic anhydrase C Carbonic anhydrase II (CA-II) Carbonic anhydrase II (hCA II) | Carbonic anhydrase isoenzyme II (hCA II)
Type:
Enzyme
Mol. Mass.:
29250.71
Organism:
Homo sapiens (Human)
Description:
P00918
Residue:
260
  
Inhibitor
Name:
BDBM50492477
Synonyms:
CHEMBL2402758
Type:
Small organic molecule
Emp. Form.:
C16H18N2O4S
Mol. Mass.:
334.39
SMILES:
COc1ccc(CC(=O)NCc2ccc(cc2)S(N)(=O)=O)cc1
: