Target
Adenosine receptor A2a
Ligand
BDBM50493144
Substrate
Meas. Tech.
ChEMBL_980555 (CHEMBL2422901)
Ki
0.004700±n/a nM
Citation
 Mishra, CBSharma, DPrakash, AKumari, NKumar, NLuthra, PM Design and synthesis of (4E)-4-(4-substitutedbenzylideneamino)-3-substituted-2,3-dihydro-2-thioxothiazole-5-carbonitrile as novel A2A receptor antagonists. Bioorg Med Chem 21:6077-83 (2013)  
Target
Name:
Adenosine receptor A2a
Synonyms:
A2A adenosine receptor (hA2A) ADENOSINE A2 ADORA2 Adenosine A2A receptor (A2AAR)
Type:
G Protein-Coupled Receptor (GPCR)
Mol. Mass.:
44716.46
Organism:
Homo sapiens (Human)
Description:
P29274
Residue:
412
  
Inhibitor
Name:
BDBM50493144
Synonyms:
CHEMBL2419144
Type:
Small organic molecule
Emp. Form.:
C17H10FN3S2
Mol. Mass.:
339.41
SMILES:
Fc1ccc(\C=N\c2c(sc(=S)n2-c2ccccc2)C#N)cc1
: