Target
Sterol O-acyltransferase 1
Ligand
BDBM50038920
Substrate
Meas. Tech.
ChEMBL_28505 (CHEMBL645934)
IC50
12±n/a nM
Citation
 Tawada, HHarcourt, MKawamura, NKajino, MIshikawa, ESugiyama, YIkeda, HMeguro, K Novel acyl-CoA:cholesterol acyltransferase inhibitors. Synthesis and biological activity of 3-quinolylurea derivatives. J Med Chem 37:2079-84 (1994)  
Target
Name:
Sterol O-acyltransferase 1
Synonyms:
ACAT-1 Acat SOAT1_RAT Sterol O-acyltransferase, Soat
Type:
PROTEIN
Mol. Mass.:
64165.56
Organism:
Rattus norvegicus
Description:
ChEMBL_28796
Residue:
545
  
Inhibitor
Name:
BDBM50038920
Synonyms:
1-[6-Chloro-4-(2-chloro-phenyl)-8-methyl-quinolin-3-yl]-3-(2,4-difluoro-phenyl)-urea | CHEMBL63674
Type:
Small organic molecule
Emp. Form.:
C23H15Cl2F2N3O
Mol. Mass.:
458.288
SMILES:
Cc1cc(Cl)cc2c(c(NC(=O)Nc3ccc(F)cc3F)cnc12)-c1ccccc1Cl
: