Target
Phosphodiesterase
Ligand
BDBM50038991
Substrate
Meas. Tech.
ChEMBL_155976 (CHEMBL762029)
IC50
>100000±n/a nM
Citation
 Takase, YSaeki, TWatanabe, NAdachi, HSouda, SSaito, I Cyclic GMP phosphodiesterase inhibitors. 2. Requirement of 6-substitution of quinazoline derivatives for potent and selective inhibitory activity. J Med Chem 37:2106-11 (1994)  
Target
Name:
Phosphodiesterase
Synonyms:
Phosphodiesterase 3A
Type:
PROTEIN
Mol. Mass.:
108833.33
Organism:
Sus scrofa
Description:
ChEMBL_155977
Residue:
985
  
Inhibitor
Name:
BDBM50038991
Synonyms:
Benzo[1,3]dioxol-5-ylmethyl-(6-chloro-quinazolin-4-yl)-amine | CHEMBL66620
Type:
Small organic molecule
Emp. Form.:
C16H12ClN3O2
Mol. Mass.:
313.738
SMILES:
Clc1ccc2ncnc(NCc3ccc4OCOc4c3)c2c1
: