Target
Kappa-type opioid receptor
Ligand
BDBM50039101
Substrate
Meas. Tech.
ChEMBL_145681 (CHEMBL754277)
IC50
0.39±n/a nM
Citation
 Naylor, AJudd, DBScopes, DIHayes, AGBirch, PJ 4-[(Alkylamino)methyl]furo[3,2-c]pyridines: a new series of selective kappa-receptor agonists. J Med Chem 37:2138-44 (1994)  
Target
Name:
Kappa-type opioid receptor
Synonyms:
K-OR-1 Kappa-opioid receptor (KOR) Kappa-type opioid receptor (KOR) OPIATE Kappa OPRK1 kappa opioid receptor (KOR)
Type:
G Protein-Coupled Receptor (GPCR)
Mol. Mass.:
42648.76
Organism:
Homo sapiens (Human)
Description:
P41145
Residue:
380
  
Inhibitor
Name:
BDBM50039101
Synonyms:
2-(3,4-Dichloro-phenyl)-1-[4-(3-hydroxy-pyrrolidin-1-ylmethyl)-2-methyl-6,7-dihydro-4H-furo[3,2-c]pyridin-5-yl]-ethanone | CHEMBL302036
Type:
Small organic molecule
Emp. Form.:
C21H24Cl2N2O3
Mol. Mass.:
423.333
SMILES:
Cc1cc2C(CN3CCC(O)C3)N(CCc2o1)C(=O)Cc1ccc(Cl)c(Cl)c1
: