Target
Beta-2 adrenergic receptor
Ligand
BDBM86453
Substrate
Meas. Tech.
ChEMBL_982327 (CHEMBL2426847)
Kd
2.5±n/a nM
Citation
 Peterson, YKCameron, RBWills, LPTrager, RELindsey, CCBeeson, CCSchnellmann, RG ?2-Adrenoceptor agonists in the regulation of mitochondrial biogenesis. Bioorg Med Chem Lett 23:5376-81 (2013)  
Target
Name:
Beta-2 adrenergic receptor
Synonyms:
ADRB2 ADRB2_HUMAN Beta-2 adrenoceptor | Beta-2 adrenoreceptor
Type:
Mol. Mass.:
46461.69
Organism:
Homo sapiens (Human)
Description:
P07550
Residue:
413
  
Inhibitor
Name:
BDBM86453
Synonyms:
CAS_73573-87-2 NSC_3083544
Type:
Small organic molecule
Emp. Form.:
C19H24N2O4
Mol. Mass.:
344.4049
SMILES:
COc1ccc(CC(C)NCC(O)c2ccc(O)c(NC=O)c2)cc1
: