Target
cAMP-specific 3',5'-cyclic phosphodiesterase 4B
Ligand
BDBM14774
Substrate
Meas. Tech.
ChEMBL_982651 (CHEMBL2428563)
IC50
1.1±n/a nM
Citation
 Kojima, ATakita, SSumiya, TOchiai, KIwase, KKishi, TOhinata, AYageta, YYasue, TKohno, Y Phosphodiesterase inhibitors. Part 6: design, synthesis, and structure-activity relationships of PDE4-inhibitory pyrazolo[1,5-a]pyridines with anti-inflammatory activity. Bioorg Med Chem Lett 23:5311-6 (2013)  
Target
Name:
cAMP-specific 3',5'-cyclic phosphodiesterase 4B
Synonyms:
3',5'-cyclic phosphodiesterase Isoform PDE4B1 PDE4B PDE4B_HUMAN Phosphodiesterase 4B (PDE4B) Phosphodiesterase Type 4 (PDE4B)
Type:
Protein
Mol. Mass.:
83318.87
Organism:
Homo sapiens (Human)
Description:
Q07343
Residue:
736
  
Inhibitor
Name:
BDBM14774
Synonyms:
3-(cyclopropylmethoxy)-N-(3,5-dichloropyridin-4-yl)-4-(difluoromethoxy)benzamide DAXAS Roflumilast
Type:
Small organic molecule
Emp. Form.:
C17H14Cl2F2N2O3
Mol. Mass.:
403.207
SMILES:
FC(F)Oc1ccc(cc1OCC1CC1)C(=O)Nc1c(Cl)cncc1Cl
: