Target
Sodium- and chloride-dependent GABA transporter 2
Ligand
BDBM50039236
Substrate
Meas. Tech.
ChEMBL_202727 (CHEMBL809055)
IC50
84000±n/a nM
Citation
 Dhar, TGBorden, LATyagarajan, SSmith, KEBranchek, TAWeinshank, RLGluchowski, C Design, synthesis and evaluation of substituted triarylnipecotic acid derivatives as GABA uptake inhibitors: identification of a ligand with moderate affinity and selectivity for the cloned human GABA transporter GAT-3. J Med Chem 37:2334-42 (1994)  
Target
Name:
Sodium- and chloride-dependent GABA transporter 2
Synonyms:
GABA transporter Gabt2 S6A13_RAT | Slc6a13
Type:
PROTEIN
Mol. Mass.:
68261.89
Organism:
Rattus norvegicus
Description:
ChEMBL_70051
Residue:
602
  
Inhibitor
Name:
BDBM50039236
Synonyms:
1-{2-[Tris-(4-methoxy-phenyl)-methylsulfanyl]-ethyl}-piperidine-3-carboxylic acid | CHEMBL307361
Type:
Small organic molecule
Emp. Form.:
C30H35NO5S
Mol. Mass.:
521.668
SMILES:
COc1ccc(cc1)C(SCCN1CCCC(C1)C(O)=O)(c1ccc(OC)cc1)c1ccc(OC)cc1
: