Target
Sodium- and chloride-dependent betaine transporter
Ligand
BDBM50039245
Substrate
Meas. Tech.
ChEMBL_202584 (CHEMBL806334)
IC50
39000±n/a nM
Citation
 Dhar, TGBorden, LATyagarajan, SSmith, KEBranchek, TAWeinshank, RLGluchowski, C Design, synthesis and evaluation of substituted triarylnipecotic acid derivatives as GABA uptake inhibitors: identification of a ligand with moderate affinity and selectivity for the cloned human GABA transporter GAT-3. J Med Chem 37:2334-42 (1994)  
Target
Name:
Sodium- and chloride-dependent betaine transporter
Synonyms:
Betaine transporter SLC6A12
Type:
PROTEIN
Mol. Mass.:
69366.52
Organism:
Homo sapiens (Human)
Description:
ChEMBL_1454199
Residue:
614
  
Inhibitor
Name:
BDBM50039245
Synonyms:
CHEMBL309357 | Dimethyl-[2-(1,7,7-trimethyl-2-phenyl-bicyclo[2.2.1]hept-2-yloxy)-ethyl]-amine
Type:
Small organic molecule
Emp. Form.:
C20H31NO
Mol. Mass.:
301.4662
SMILES:
CN(C)CCOC1(CC2CCC1(C)C2(C)C)c1ccccc1
: