Target
Sodium- and chloride-dependent GABA transporter 2
Ligand
BDBM90787
Substrate
Meas. Tech.
ChEMBL_202727 (CHEMBL809055)
IC50
58000±n/a nM
Citation
 Dhar, TGBorden, LATyagarajan, SSmith, KEBranchek, TAWeinshank, RLGluchowski, C Design, synthesis and evaluation of substituted triarylnipecotic acid derivatives as GABA uptake inhibitors: identification of a ligand with moderate affinity and selectivity for the cloned human GABA transporter GAT-3. J Med Chem 37:2334-42 (1994)  
Target
Name:
Sodium- and chloride-dependent GABA transporter 2
Synonyms:
GABA transporter Gabt2 S6A13_RAT | Slc6a13
Type:
PROTEIN
Mol. Mass.:
68261.89
Organism:
Rattus norvegicus
Description:
ChEMBL_70051
Residue:
602
  
Inhibitor
Name:
BDBM90787
Synonyms:
1,2,3,6-tetrahydropyridine-5-carboxylic acid;hydrochloride Guvacine hydrochloride SMR000326834 | cid_11957555
Type:
Small organic molecule
Emp. Form.:
C6H9NO2
Mol. Mass.:
127.1412
SMILES:
OC(=O)C1=CCCNC1
: