Target
Sodium- and chloride-dependent betaine transporter
Ligand
BDBM50039247
Substrate
Meas. Tech.
ChEMBL_202584 (CHEMBL806334)
IC50
2660000±n/a nM
Citation
 Dhar, TGBorden, LATyagarajan, SSmith, KEBranchek, TAWeinshank, RLGluchowski, C Design, synthesis and evaluation of substituted triarylnipecotic acid derivatives as GABA uptake inhibitors: identification of a ligand with moderate affinity and selectivity for the cloned human GABA transporter GAT-3. J Med Chem 37:2334-42 (1994)  
Target
Name:
Sodium- and chloride-dependent betaine transporter
Synonyms:
Betaine transporter SLC6A12
Type:
PROTEIN
Mol. Mass.:
69366.52
Organism:
Homo sapiens (Human)
Description:
ChEMBL_1454199
Residue:
614
  
Inhibitor
Name:
BDBM50039247
Synonyms:
1-{2-[Tris-(4-methoxy-phenyl)-methoxy]-ethyl}-1,2,5,6-tetrahydro-pyridine-3-carboxylic acid | CHEMBL405620
Type:
Small organic molecule
Emp. Form.:
C30H33NO6
Mol. Mass.:
503.5861
SMILES:
COc1ccc(cc1)C(OCCN1CCC=C(C1)C(O)=O)(c1ccc(OC)cc1)c1ccc(OC)cc1
: