Target
Type-1 angiotensin II receptor B
Ligand
BDBM50039342
Substrate
Meas. Tech.
ChEMBL_36643 (CHEMBL652353)
Ki
24±n/a nM
Citation
 Nicolaï, ECuré, GGoyard, JKirchner, MTeulon, JMVersigny, ACazes, MCaussade, FVirone-Oddos, ACloarec, A Synthesis and SAR studies of novel triazolopyrimidine derivatives as potent, orally active angiotensin II receptor antagonists. J Med Chem 37:2371-86 (1994)  
Target
Name:
Type-1 angiotensin II receptor B
Synonyms:
AGTRB_RAT Agtr1 Angiotensin II AT1B Angiotensin II type 1b (AT-1b) receptor Type-1B angiotensin II receptor
Type:
Enzyme Catalytic Domain
Mol. Mass.:
40929.44
Organism:
RAT
Description:
Angiotensin II AT1B 0 RAT::P29089
Residue:
359
  
Inhibitor
Name:
BDBM50039342
Synonyms:
5-Methyl-7-propyl-8-[2'-(1H-tetrazol-5-yl)-biphenyl-4-ylmethyl]-3H-[1,2,4]triazolo[1,5-c]pyrimidin-2-ol CHEMBL312104
Type:
Small organic molecule
Emp. Form.:
C23H22N8O
Mol. Mass.:
426.4738
SMILES:
CCCc1nc(C)n2[nH]c(=O)nc2c1Cc1ccc(cc1)-c1ccccc1-c1nnn[nH]1
: