Target
5-hydroxytryptamine receptor 1A
Ligand
BDBM50039566
Substrate
Meas. Tech.
ChEMBL_832 (CHEMBL615832)
IC50
120±n/a nM
Citation
 Macor, JEBlank, DHFox, CBLebel, LANewman, MEPost, RJRyan, KSchmidt, AWSchulz, DWKoe, BK 5-[(3-nitropyrid-2-yl)amino]indoles: novel serotonin agonists with selectivity for the 5-HT1D receptor. Variation of the C3 substituent on the indole template leads to increased 5-HT1D receptor selectivity. J Med Chem 37:2509-12 (1994)  
Target
Name:
5-hydroxytryptamine receptor 1A
Synonyms:
5-HT-1A 5-HT1A 5-hydroxytryptamine receptor 1A (5HT1A) 5ht1a Htr1a Serotonin 1a (5-HT1a) receptor/Adrenergic receptor alpha-1 | Serotonin receptor 1A
Type:
G Protein-Coupled Receptor (GPCR)
Mol. Mass.:
46445.29
Organism:
Rattus norvegicus (rat)
Description:
Binding assays were performed using rat hippocampal membranes.
Residue:
422
  
Inhibitor
Name:
BDBM50039566
Synonyms:
(3-Nitro-pyridin-2-yl)-(3-(R)-1-pyrrolidin-2-ylmethyl-1H-indol-5-yl)-amine | CHEMBL84107
Type:
Small organic molecule
Emp. Form.:
C18H19N5O2
Mol. Mass.:
337.3758
SMILES:
[O-][N+](=O)c1cccnc1Nc1ccc2[nH]cc(C[C@H]3CCCN3)c2c1
: