Target
5-hydroxytryptamine receptor 1D
Ligand
BDBM10755
Substrate
Meas. Tech.
ChEMBL_1974 (CHEMBL617579)
IC50
3±n/a nM
Citation
 Macor, JEBlank, DHFox, CBLebel, LANewman, MEPost, RJRyan, KSchmidt, AWSchulz, DWKoe, BK 5-[(3-nitropyrid-2-yl)amino]indoles: novel serotonin agonists with selectivity for the 5-HT1D receptor. Variation of the C3 substituent on the indole template leads to increased 5-HT1D receptor selectivity. J Med Chem 37:2509-12 (1994)  
Target
Name:
5-hydroxytryptamine receptor 1D
Synonyms:
5-HT-1D 5-hydroxytryptamine receptor 1D Htr1d Serotonin 1B/1D receptor | Serotonin receptor 1D
Type:
Enzyme Catalytic Domain
Mol. Mass.:
41551.75
Organism:
RAT
Description:
5-HT1D HTR1D RAT::P28565
Residue:
374
  
Inhibitor
Name:
BDBM10755
Synonyms:
14C-5-hydroxy tryptamine creatinine disulfate 5-HT 5-hydroxy tryptamine creatinine disulfate Serotonin | [3H]-5-HT
Type:
Small organic molecule
Emp. Form.:
C10H12N2O
Mol. Mass.:
176.2151
SMILES:
NCCc1c[nH]c2ccc(O)cc12
: