Target
5-hydroxytryptamine receptor 3A/3B
Ligand
BDBM50028979
Substrate
Meas. Tech.
ChEMBL_3235 (CHEMBL618921)
Ki
40±n/a nM
Citation
 Phillips, STde Paulis, TBaron, BMSiegel, BWSeeman, PVan Tol, HHGuan, HCSmith, HE Binding of 5H-dibenzo[b,e][1,4]diazepine and chiral 5H-dibenzo[a,d]cycloheptene analogues of clozapine to dopamine and serotonin receptors. J Med Chem 37:2686-96 (1994)  
Target
Name:
5-hydroxytryptamine receptor 3A/3B
Synonyms:
Serotonin 3 (5-HT3) receptor | Serotonin 3a (5-HT3a)/3b (5-HT3b) receptor
Type:
Mol. Mass.:
Description:
ASSAY_ID of EBI is 2974
Components:
This complex has 2 components.
Component 1
Name:
5-hydroxytryptamine receptor 3B
Synonyms:
5HT3B_RAT Serotonin (5-HT) receptor
Type:
PROTEIN
Mol. Mass.:
50328.78
Organism:
Rattus norvegicus
Description:
EBI_11885
Residue:
437
  
Component 2
Name:
5-hydroxytryptamine receptor 3A
Synonyms:
5-HT3 5HT3A_RAT Htr3 Serotonin (5-HT) receptor | Zacopride site-R
Type:
Enzyme Catalytic Domain
Mol. Mass.:
55428.70
Organism:
RAT
Description:
5-HT3 HTR3A RAT::P35563
Residue:
483
  
Inhibitor
Name:
BDBM50028979
Synonyms:
8-Chloro-5-methyl-11-(4-methyl-piperazin-1-yl)-5H-dibenzo[b,e][1,4]diazepine | CHEMBL266723
Type:
Small organic molecule
Emp. Form.:
C19H21ClN4
Mol. Mass.:
340.85
SMILES:
CN1CCN(CC1)C1=Nc2cc(Cl)ccc2N(C)c2ccccc12
: