Target
Acetylcholinesterase
Ligand
BDBM50039733
Substrate
Meas. Tech.
ChEMBL_28150 (CHEMBL644105)
IC50
220±n/a nM
Citation
 Villalobos, ABlake, JFBiggers, CKButler, TWChapin, DSChen, YLIves, JLJones, SBListon, DRNagel, AA Novel benzisoxazole derivatives as potent and selective inhibitors of acetylcholinesterase. J Med Chem 37:2721-34 (1994)  
Target
Name:
Acetylcholinesterase
Synonyms:
ACES_HUMAN Acetylcholinesterase (AChE) | Acetylcholinesterase (human AChE)
Type:
Enzyme
Mol. Mass.:
67792.70
Organism:
Homo sapiens (Human)
Description:
P22303
Residue:
614
  
Inhibitor
Name:
BDBM50039733
Synonyms:
1-(2-(1-benzylpiperidin-4-yl)ethyl)isoquinoline CHEMBL92142
Type:
Small organic molecule
Emp. Form.:
C23H26N2
Mol. Mass.:
330.4659
SMILES:
C(Cc1nccc2ccccc12)C1CCN(Cc2ccccc2)CC1
: