Target
Serine/threonine-protein kinase B-raf
Ligand
BDBM50493623
Substrate
Meas. Tech.
ChEMBL_988577 (CHEMBL2438528)
IC50
68±n/a nM
Citation
 Newhouse, BJWenglowsky, SGrina, JLaird, ERVoegtli, WCRen, LAhrendt, KBuckmelter, AGloor, SLKlopfenstein, NRudolph, JWen, ZLi, XFeng, B Imidazo[4,5-b]pyridine inhibitors of B-Raf kinase. Bioorg Med Chem Lett 23:5896-9 (2013)  
Target
Name:
Serine/threonine-protein kinase B-raf
Synonyms:
B-RAF B-Raf proto-oncogene serine/threonine-protein kinase BRAF1 RAFB1 v-Raf murine sarcoma viral oncogene homolog B1
Type:
Serine/threonine-protein kinase
Mol. Mass.:
84446.00
Organism:
Homo sapiens (Human)
Description:
P15056
Residue:
766
  
Inhibitor
Name:
BDBM50493623
Synonyms:
CHEMBL2436806
Type:
Small organic molecule
Emp. Form.:
C22H18ClF2N5O3S
Mol. Mass.:
505.925
SMILES:
CCCS(=O)(=O)Nc1ccc(F)c(C(=O)Nc2cnc3[nH]c(nc3c2)-c2cccc(Cl)c2)c1F
: