Target
Delta-type opioid receptor
Ligand
BDBM50493714
Substrate
Meas. Tech.
ChEMBL_988384 (CHEMBL2437811)
Ki
0.267000±n/a nM
Citation
 Loriga, GLazzari, PRuiu, SMarchese, GManca, ICasu, GLDessė, CPinna, GAAsproni, BMurineddu, G Synthesis and biological evaluation of novel delta (?) opioid receptor ligands with diazatricyclodecane skeletons. Eur J Med Chem 69:413-26 (2013)  
Target
Name:
Delta-type opioid receptor
Synonyms:
DOR-1 MSL-2 OPRD_MOUSE Oprd1
Type:
Enzyme Catalytic Domain
Mol. Mass.:
40577.25
Organism:
MOUSE
Description:
P32300
Residue:
372
  
Inhibitor
Name:
BDBM50493714
Synonyms:
CHEMBL2436056
Type:
Small organic molecule
Emp. Form.:
C29H37N3O2
Mol. Mass.:
459.623
SMILES:
CCN(CC)C(=O)c1ccc(cc1)C(N1C2CCC3C1CCC2N3CC=C)c1cccc(O)c1
: