Target
Calpain-2 catalytic subunit
Ligand
BDBM50039994
Substrate
Meas. Tech.
ChEMBL_43845 (CHEMBL658507)
Ki
50±n/a nM
Citation
 Harbeson, SLAbelleira, SMAkiyama, ABarrett, RCarroll, RMStraub, JATkacz, JNWu, CMusso, GF Stereospecific synthesis of peptidyl alpha-keto amides as inhibitors of calpain. J Med Chem 37:2918-29 (1994)  
Target
Name:
Calpain-2 catalytic subunit
Synonyms:
CAN2_BOVIN Calpain 2
Type:
PROTEIN
Mol. Mass.:
79905.09
Organism:
Bos taurus
Description:
ChEMBL_43846
Residue:
700
  
Inhibitor
Name:
BDBM50039994
Synonyms:
CHEMBL419898 | [(S)-1-(1-Ethylcarbamoyl-butylcarbamoyl)-3-methyl-butyl]-carbamic acid benzyl ester
Type:
Small organic molecule
Emp. Form.:
C21H33N3O4
Mol. Mass.:
391.5044
SMILES:
CCCC(NC(=O)[C@H](CC(C)C)NC(=O)OCc1ccccc1)C(=O)NCC
: