Target
Calpain-1 catalytic subunit
Ligand
BDBM50040008
Substrate
Meas. Tech.
ChEMBL_43688 (CHEMBL653666)
Ki
170±n/a nM
Citation
 Harbeson, SLAbelleira, SMAkiyama, ABarrett, RCarroll, RMStraub, JATkacz, JNWu, CMusso, GF Stereospecific synthesis of peptidyl alpha-keto amides as inhibitors of calpain. J Med Chem 37:2918-29 (1994)  
Target
Name:
Calpain-1 catalytic subunit
Synonyms:
CAN1_HUMAN CAPN1 Calpain-1 (u-Calpain) Calpain1
Type:
Protein
Mol. Mass.:
81880.51
Organism:
Homo sapiens (Human)
Description:
Residue:
714
  
Inhibitor
Name:
BDBM50040008
Synonyms:
CHEMBL100395 | [(S)-1-(3-Ethylcarbamoyl-propylcarbamoyl)-3-methyl-butyl]-carbamic acid tert-butyl ester
Type:
Small organic molecule
Emp. Form.:
C17H33N3O4
Mol. Mass.:
343.4616
SMILES:
CCNC(=O)CCCNC(=O)[C@H](CC(C)C)NC(=O)OC(C)(C)C
: