Target
5-hydroxytryptamine receptor 1A
Ligand
BDBM50034341
Substrate
Meas. Tech.
ChEMBL_1572 (CHEMBL616562)
Ki
>333±n/a nM
Citation
 Lin, CHHaadsma-Svensson, SRLahti, RAMcCall, RBPiercey, MFSchreur, PJVon Voigtlander, PFSmith, MWChidester, CG Centrally acting serotonergic and dopaminergic agents. 1. Synthesis and structure-activity relationships of 2,3,3a,4,5,9b-hexahydro-1H-benz[e]indole derivatives. J Med Chem 36:1053-68 (1993)  
Target
Name:
5-hydroxytryptamine receptor 1A
Synonyms:
5-HT1A 5-hydroxytryptamine receptor 1A (5HT1A) Gpcr18 Serotonin 1a (5-HT1a) receptor
Type:
Enzyme
Mol. Mass.:
46192.09
Organism:
Mus musculus (Mouse)
Description:
Q64264
Residue:
421
  
Inhibitor
Name:
BDBM50034341
Synonyms:
(3aR,9bS)-3-allyl-6-methoxy-2,3,3a,4,5,9b-hexahydro-1H-benzo[e]indole CHEMBL280955
Type:
Small organic molecule
Emp. Form.:
C16H21NO
Mol. Mass.:
243.344
SMILES:
COc1cccc2[C@@H]3CCN(CC=C)[C@@H]3CCc12
: