Target
Gastrin-releasing peptide receptor
Ligand
BDBM50040325
Substrate
Meas. Tech.
ChEMBL_458 (CHEMBL615688)
IC50
0.038000±n/a nM
Citation
 Leban, JJLandavazo, AMcDermed, JDDiliberto, EJJansen, MStockstill, BKull, FC Potent gastrin-releasing peptide (GRP) antagonists derived from GRP (19-27) with a C-terminal DPro psi [CH2NH]Phe-NH2 and N-terminal aromatic residues. J Med Chem 37:439-45 (1994)  
Target
Name:
Gastrin-releasing peptide receptor
Synonyms:
GRP-R GRPR_MOUSE Gastrin-releasing peptide receptor | Grpr
Type:
Enzyme Catalytic Domain
Mol. Mass.:
43234.59
Organism:
MOUSE
Description:
Gastrin-Releasing peptide 0 MOUSE::P21729
Residue:
384
  
Inhibitor
Name:
BDBM50040325
Synonyms:
CHEMBL268386 | PhCH2CH2(CO)His-Trp-Ala-Val-DAla-His-DPro(psi)DPhe-NH2
Type:
Small organic molecule
Emp. Form.:
C57H72N14O8
Mol. Mass.:
1081.2706
SMILES:
CC(C)[C@H](NC(=O)[C@H](C)NC(=O)[C@H](Cc1c[nH]c2ccccc12)NC(=O)[C@H](Cc1cnc[nH]1)NC(=O)CCc1ccccc1)C(=O)N[C@H](C)C(=O)N[C@@H](Cc1cnc[nH]1)C(=O)N1CCC[C@@H]1CN[C@@H](Cc1ccccc1)C(N)=O
: