Target
Platelet-activating factor acetylhydrolase [136-227]
Ligand
BDBM50004499
Substrate
Meas. Tech.
ChEMBL_156342 (CHEMBL759985)
IC50
300±n/a nM
Citation
 Beaton, HGBennion, CConnolly, SCook, ARGensmantel, NPHallam, CHardy, KHitchin, BJackson, CGRobinson, DH Discovery of new non-phospholipid inhibitors of the secretory phospholipases A2. J Med Chem 37:557-9 (1994)  
Target
Name:
Platelet-activating factor acetylhydrolase [136-227]
Synonyms:
A0A5G2RFL7_PIG PLA2G7
Type:
PROTEIN
Mol. Mass.:
10360.56
Organism:
Sus scrofa
Description:
ChEMBL_156342
Residue:
92
  
Inhibitor
Name:
BDBM50004499
Synonyms:
(R)-O-(2-Hexadecanamidoisohexyl) phosphocholine {2-[(2-Hexadecanoyl amino-4-methyl-p entyloxy)-hydroxy-phoryloxy]-ethyl}-trimethyl-ammonium
Type:
Small organic molecule
Emp. Form.:
C27H57N2O5P
Mol. Mass.:
520.7256
SMILES:
CCCCCCCCCCCCCCCC(=O)N[C@@H](COP([O-])(=O)OCC[N+](C)(C)C)CC(C)C
: