Target
Kappa-type opioid receptor
Ligand
BDBM50494232
Substrate
Meas. Tech.
ChEMBL_1277197 (CHEMBL3088917)
Ki
7.8±n/a nM
Citation
 Carroll, FIGichinga, MGWilliams, JDVardy, ERoth, BLMascarella, SWThomas, JBNavarro, HA 4?-Methyl-5-(3-hydroxyphenyl)morphan opioid agonist and partial agonist derived from a 4?-methyl-5-(3-hydroxyphenyl)morphan pure antagonist. J Med Chem 56:8826-33 (2013)  
Target
Name:
Kappa-type opioid receptor
Synonyms:
K-OR-1 Kappa-opioid receptor (KOR) Kappa-type opioid receptor (KOR) OPIATE Kappa OPRK1 kappa opioid receptor (KOR)
Type:
G Protein-Coupled Receptor (GPCR)
Mol. Mass.:
42648.76
Organism:
Homo sapiens (Human)
Description:
P41145
Residue:
380
  
Inhibitor
Name:
BDBM50494232
Synonyms:
CHEMBL3086466
Type:
Small organic molecule
Emp. Form.:
C24H32ClNO
Mol. Mass.:
385.97
SMILES:
Cl.[H][C@@]12CCC[C@](C1)([C@H](C)CN2CCCc1ccccc1)c1cccc(O)c1
: