Target
Acetylcholinesterase
Ligand
BDBM8961
Substrate
Meas. Tech.
ChEMBL_1276880 (CHEMBL3089681)
IC50
383±n/a nM
Citation
 Prati, FBartolini, MSimoni, EDe Simone, APinto, AAndrisano, VBolognesi, ML Quinones bearing non-steroidal anti-inflammatory fragments as multitarget ligands for Alzheimer's disease. Bioorg Med Chem Lett 23:6254-8 (2013)  
Target
Name:
Acetylcholinesterase
Synonyms:
ACES_HUMAN Acetylcholinesterase (AChE) | Acetylcholinesterase (human AChE)
Type:
Enzyme
Mol. Mass.:
67792.70
Organism:
Homo sapiens (Human)
Description:
P22303
Residue:
614
  
Inhibitor
Name:
BDBM8961
Synonyms:
1,2,3,4-tetrahydro-9-acridinamine 9-THA CHEMBL1337960 Cognex Tracine cid_1935 | tacrine.HCl
Type:
Small organic molecule
Emp. Form.:
C13H14N2
Mol. Mass.:
198.2637
SMILES:
Nc1c2CCCCc2nc2ccccc12
: