Target
Acyl-CoA:cholesterol acyltransferase
Ligand
BDBM50040815
Substrate
Meas. Tech.
ChEMBL_28192 (CHEMBL637685)
IC50
7±n/a nM
Citation
 Kumazawa, TYanase, MHarakawa, HObase, HShirakura, SOhishi, EOda, SKubo, KYamada, K Inhibitors of acyl-CoA:cholesterol acyltransferase. 1. Synthesis and hypocholesterolemic activity of dibenz[b,e]oxepin-11-carboxanilides. J Med Chem 37:804-10 (1994)  
Target
Name:
Acyl-CoA:cholesterol acyltransferase
Synonyms:
ACAT
Type:
Mol. Mass.:
35405.31
Organism:
Oryctolagus cuniculus
Description:
Residue:
305
  
Inhibitor
Name:
BDBM50040815
Synonyms:
2-Methylsulfanyl-6,11-dihydro-dibenzo[b,e]oxepine-11-carboxylic acid (2,6-diisopropyl-phenyl)-amide | CHEMBL353791
Type:
Small organic molecule
Emp. Form.:
C28H31NO2S
Mol. Mass.:
445.616
SMILES:
CSc1ccc2OCc3ccccc3C(C(=O)Nc3c(cccc3C(C)C)C(C)C)c2c1
: