Target
Epidermal growth factor receptor
Ligand
BDBM50040929
Substrate
Meas. Tech.
ChEMBL_29499 (CHEMBL642000)
Ki
160±n/a nM
Citation
 Trinks, UBuchdunger, EFuret, PKump, WMett, HMeyer, TMüller, MRegenass, URihs, GLydon, N Dianilinophthalimides: potent and selective, ATP-competitive inhibitors of the EGF-receptor protein tyrosine kinase. J Med Chem 37:1015-27 (1994)  
Target
Name:
Epidermal growth factor receptor
Synonyms:
EGF Receptor Substrate EGFR_HUMAN ERBB1 Epidermal Growth Factor Receptor erbB-1 Epidermal growth factor receptor (EGFR) HER1 Proto-oncogene c-ErbB-1 Tyrosine-Protein Kinase ErbB-1
Type:
Receptor Kinase Domain
Mol. Mass.:
134279.59
Organism:
Homo sapiens (Human)
Description:
P00533
Residue:
1210
  
Inhibitor
Name:
BDBM50040929
Synonyms:
4,5-dianilinophthalimide CHEMBL268868 | Cgp 52411
Type:
Small organic molecule
Emp. Form.:
C20H15N3O2
Mol. Mass.:
329.352
SMILES:
O=C1NC(=O)c2cc(Nc3ccccc3)c(Nc3ccccc3)cc12
: