Target
cAMP-dependent protein kinase
Ligand
BDBM50040916
Substrate
Meas. Tech.
ChEMBL_152945 (CHEMBL874643)
IC50
>500000±n/a nM
Citation
 Trinks, UBuchdunger, EFuret, PKump, WMett, HMeyer, TMüller, MRegenass, URihs, GLydon, N Dianilinophthalimides: potent and selective, ATP-competitive inhibitors of the EGF-receptor protein tyrosine kinase. J Med Chem 37:1015-27 (1994)  
Target
Name:
cAMP-dependent protein kinase
Synonyms:
Cyclic AMP-dependent protein kinase (PKA) Serine/threonine-protein kinase | cAMP-dependent protein kinase alpha-catalytic subunit
Type:
Enzyme
Mol. Mass.:
40766.33
Organism:
Oryctolagus cuniculus (Rabbit)
Description:
Q95J97
Residue:
351
  
Inhibitor
Name:
BDBM50040916
Synonyms:
5,6-Bis-(4-hydroxy-phenylamino)-isoindole-1,3-dione | CHEMBL267019
Type:
Small organic molecule
Emp. Form.:
C20H15N3O4
Mol. Mass.:
361.3508
SMILES:
Oc1ccc(Nc2cc3C(=O)NC(=O)c3cc2Nc2ccc(O)cc2)cc1
: