Target
Acetylcholinesterase
Ligand
BDBM50423877
Substrate
Meas. Tech.
ChEMBL_1279630 (CHEMBL3097894)
Ki
600±n/a nM
Citation
 Cheung, JGary, ENShiomi, KRosenberry, TL Structures of human acetylcholinesterase bound to dihydrotanshinone I and territrem B show peripheral site flexibility. ACS Med Chem Lett 4:1091-6 (2013)  
Target
Name:
Acetylcholinesterase
Synonyms:
ACES_HUMAN Acetylcholinesterase (AChE) | Acetylcholinesterase (human AChE)
Type:
Enzyme
Mol. Mass.:
67792.70
Organism:
Homo sapiens (Human)
Description:
P22303
Residue:
614
  
Inhibitor
Name:
BDBM50423877
Synonyms:
DIHYDROTANSHINONE acs.jmedchem.1c00409_ST.562
Type:
Small organic molecule
Emp. Form.:
C18H14O3
Mol. Mass.:
278.302
SMILES:
C[C@H]1COC2=C1C(=O)C(=O)c1c2ccc2c(C)cccc12
: