Target
Thymidylate synthase
Ligand
BDBM50041176
Substrate
Meas. Tech.
ChEMBL_209119 (CHEMBL812568)
IC50
>200000±n/a nM
Citation
 Gangjee, ADevraj, RMcGuire, JJKisliuk, RLQueener, SFBarrows, LR Classical and nonclassical furo[2,3-d]pyrimidines as novel antifolates: synthesis and biological activities. J Med Chem 37:1169-76 (1994)  
Target
Name:
Thymidylate synthase
Synonyms:
TSase Thymidylate Synthase (TS) thyA
Type:
Enzyme
Mol. Mass.:
36576.54
Organism:
Lactobacillus casei
Description:
Residue:
316
  
Inhibitor
Name:
BDBM50041176
Synonyms:
2-{4-[(2,4-Diamino-furo[2,3-d]pyrimidin-5-ylmethyl)-methyl-amino]-benzoylamino}-pentanedioic acid | CHEMBL278515
Type:
Small organic molecule
Emp. Form.:
C20H22N6O6
Mol. Mass.:
442.4253
SMILES:
CN(Cc1coc2nc(N)nc(N)c12)c1ccc(cc1)C(=O)NC(CCC(O)=O)C(O)=O
: