Target
Coagulation factor X
Ligand
BDBM50041229
Substrate
Meas. Tech.
ChEMBL_48624 (CHEMBL659605)
IC50
45000±n/a nM
Citation
 Nagahara, TYokoyama, YInamura, KKatakura, SKomoriya, SYamaguchi, HHara, TIwamoto, M Dibasic (amidinoaryl)propanoic acid derivatives as novel blood coagulation factor Xa inhibitors. J Med Chem 37:1200-7 (1994)  
Target
Name:
Coagulation factor X
Synonyms:
Activated coagulation factor X (FXa) Coagulation factor X precursor F10 Factor X heavy chain Factor Xa Stuart-Prower factor
Type:
Enzyme
Mol. Mass.:
54726.60
Organism:
Homo sapiens (Human)
Description:
Residue:
488
  
Inhibitor
Name:
BDBM50041229
Synonyms:
2-(5-Carbamimidoyl-benzofuran-2-yl)-3-[4-((S)-pyrrolidin-3-yloxy)-phenyl]-propionic acid | CHEMBL280158
Type:
Small organic molecule
Emp. Form.:
C22H23N3O4
Mol. Mass.:
393.4357
SMILES:
NC(=N)c1ccc2oc(cc2c1)C(Cc1ccc(O[C@H]2CCNC2)cc1)C(O)=O
: