Target
Coagulation factor X
Ligand
BDBM17283
Substrate
Meas. Tech.
ChEMBL_48624 (CHEMBL659605)
IC50
70.0±n/a nM
Citation
 Nagahara, TYokoyama, YInamura, KKatakura, SKomoriya, SYamaguchi, HHara, TIwamoto, M Dibasic (amidinoaryl)propanoic acid derivatives as novel blood coagulation factor Xa inhibitors. J Med Chem 37:1200-7 (1994)  
Target
Name:
Coagulation factor X
Synonyms:
Activated coagulation factor X (FXa) Coagulation factor X precursor F10 Factor X heavy chain Factor Xa Stuart-Prower factor
Type:
Enzyme
Mol. Mass.:
54726.60
Organism:
Homo sapiens (Human)
Description:
Residue:
488
  
Inhibitor
Name:
BDBM17283
Synonyms:
(2S)-3-(7-carbamimidoylnaphthalen-2-yl)-2-(4-{[(3S)-1-ethanimidoylpyrrolidin-3-yl]oxy}phenyl)propanoic acid DX-9065a
Type:
Small organic molecule
Emp. Form.:
C26H28N4O3
Mol. Mass.:
444.5255
SMILES:
CC(=N)N1CC[C@@H](C1)Oc1ccc(cc1)[C@H](Cc1ccc2ccc(cc2c1)C(N)=N)C(O)=O
: