Target
Coagulation factor X
Ligand
BDBM50041215
Substrate
Meas. Tech.
ChEMBL_48624 (CHEMBL659605)
IC50
940.0±n/a nM
Citation
 Nagahara, TYokoyama, YInamura, KKatakura, SKomoriya, SYamaguchi, HHara, TIwamoto, M Dibasic (amidinoaryl)propanoic acid derivatives as novel blood coagulation factor Xa inhibitors. J Med Chem 37:1200-7 (1994)  
Target
Name:
Coagulation factor X
Synonyms:
Activated coagulation factor X (FXa) Coagulation factor X precursor F10 Factor X heavy chain Factor Xa Stuart-Prower factor
Type:
Enzyme
Mol. Mass.:
54726.60
Organism:
Homo sapiens (Human)
Description:
Residue:
488
  
Inhibitor
Name:
BDBM50041215
Synonyms:
2-{2-[4-((S)-Pyrrolidin-3-yloxy)-phenyl]-ethyl}-benzofuran-5-carboxamidine | CHEMBL19626
Type:
Small organic molecule
Emp. Form.:
C21H23N3O2
Mol. Mass.:
349.4262
SMILES:
NC(=N)c1ccc2oc(CCc3ccc(O[C@H]4CCNC4)cc3)cc2c1
: