Target
Sigma non-opioid intracellular receptor 1
Ligand
BDBM50041241
Substrate
Meas. Tech.
ChEMBL_200976 (CHEMBL802063)
Ki
2.7±n/a nM
Citation
 Glennon, RAAblordeppey, SYIsmaiel, AMel-Ashmawy, MBFischer, JBHowie, KB Structural features important for sigma 1 receptor binding. J Med Chem 37:1214-9 (1994)  
Target
Name:
Sigma non-opioid intracellular receptor 1
Synonyms:
Aging-associated gene 8 protein SGMR1_HUMAN SIGMAR1 SR31747-binding protein Sigma 1-type opioid receptor Sigma1R | hSigmaR1
Type:
Enzyme Catalytic Domain
Mol. Mass.:
25124.85
Organism:
Homo sapiens (Human)
Description:
Q99720
Residue:
223
  
Inhibitor
Name:
BDBM50041241
Synonyms:
(1-Benzyl-butyl)-(4-phenyl-butyl)-amine | CHEMBL434393
Type:
Small organic molecule
Emp. Form.:
C21H29N
Mol. Mass.:
295.4617
SMILES:
CCCC(Cc1ccccc1)NCCCCc1ccccc1
: