Target
Estrogen receptor beta
Ligand
BDBM17292
Substrate
Meas. Tech.
ChEMBL_1282727 (CHEMBL3102024)
IC50
0.046±n/a nM
Citation
 McCullough, CNeumann, TSGone, JRHe, ZHerrild, CWondergem Nee Lukesh, JPandey, RKDonaldson, WASem, DS Probing the human estrogen receptor-? binding requirements for phenolic mono- and di-hydroxyl compounds: a combined synthesis, binding and docking study. Bioorg Med Chem 22:303-10 (2014)  
Target
Name:
Estrogen receptor beta
Synonyms:
ER-beta ESR2_HUMAN Estradiol receptor beta (ERβ) Estrogen receptor (ER beta) Estrogen receptor beta (ER beta) NR3A2 estrogen beta
Type:
Protein
Mol. Mass.:
59238.43
Organism:
Homo sapiens (Human)
Description:
Q92731
Residue:
530
  
Inhibitor
Name:
BDBM17292
Synonyms:
(1S,10R,11S,14S,15S)-15-methyltetracyclo[8.7.0.0^{2,7}.0^{11,15}]heptadeca-2,4,6-triene-5,14-diol 17α-ethinylestradiol CHEMBL135 ESTRADIOL Ovocyclin US9040509, E2 US9561238, E2 [2,4,6,7-3H]-E2 [3H]]estradiol
Type:
Steroid
Emp. Form.:
C18H24O2
Mol. Mass.:
272.382
SMILES:
[H][C@@]12CC[C@H](O)[C@@]1(C)CC[C@]1([H])c3ccc(O)cc3CC[C@@]21[H]
: